{"text_format":"1","workbook":"xlsx","n_sheets":11,"sheets":["dash board","Assumption Sheet","financial statements","valuation","comparables","Ratio Analysis","projected financials statements","Graphs Data","strategey","Sheet1","Sheet2"],"not_rendered":{"charts":1,"images":0,"macros":1,"external_links":2,"defined_names":46,"comments":2,"pivot_tables":0},"unopened":[],"bounds":{"document_bytes":16777216,"sheet_cells":100000,"rows_first":2000,"rows_last":500,"rows_between":2000,"halvings":0,"cell_chars":16384,"cell_head_chars":4096},"cells_cut":0,"cells_raw":0,"read":"whole","date_system":"1900"}

{"sheet":"dash board","index":0,"n_rows":114,"n_cols":39,"rows_kept":114,"cut":false,"hidden":false,"merged":[]}
[null,"Key Assumptions , Variables & Ratios",null,null,null,null,null,null,null,null,"Key Assumptions , Variables & Ratios",null,null,null,null,null,null,null,null,null,null,"General Information",null,null,null,null,"Sensitivity Analaysis",null,null,null,null,null,null,null,null,null,null,null,0]
[null,"Macro Economic Assumptions",null,null,"Unit",null,null,null,null,"Meezan Key Variables & IS Assumptions",null,null,null,"Unit",{"$f":"P2-1","v":2009},{"$f":"YEAR(Y3)","v":2010},{"$f":"P2+1","v":2011},{"$f":"Q2+1","v":2012},{"$f":"R2+1","v":2013},{"$f":"S2+1","v":2014},null,"Company Name",null,null,"Meezan Bank "]
[null,"Nominal GDP 2009",null,null,"PKR MM",null,null,{"$f":"169000*'Assumption Sheet'!L12","v":13520000},null,"6 monthly KIBOR",null,null,null,"%",0.125,{"$f":"H13","v":0.14000000000000001},{"$f":"IF(P3+$H$14+$H$15>$H$16,P3+$H$14+$H$15,$H$16)","v":0.13},{"$f":"IF(Q3+$H$14+$H$15>$H$16,Q3+$H$14+$H$15,$H$16)","v":0.12000000000000001},0.11000000000000001,0.10000000000000002,0.14000000000000001,"Last Fiscal Year End (dd/mm/yy)",null,null,"2010-12-31",null,"Share in Industry Deposits","Share Price"]
[null,"Money supply (M2) 2010",null,null,"PKR MM",null,null,5799709.6587791862,null,"GDP Growth Rate",null,null,null,"%",null,{"$f":"H5","v":0.02},{"$f":"IF(P4+$H$7<=$H$6,P4+$H$7,$H$6)","v":0.03},{"$f":"IF(Q4+$H$7<=$H$6,Q4+$H$7,$H$6)","v":0.04},0.05,6.0000000000000005E-2,null,"Current Share Price",null,null,18.64,null,null,{"$f":"Y18","v":37.376888071025}]
[null,"GDP Growth rate 2010",null,null,"%",null,null,0.02,null,"Inflation",null,null,null,"%",null,{"$f":"H8","v":0.15},{"$f":"IF(P5+$H$9>$H$10,P5+$H$9,$H$10)","v":0.13999999999999999},{"$f":"IF(Q5+$H$9>$H$10,Q5+$H$9,$H$10)","v":0.12999999999999998},{"$f":"IF(R5+$H$9>$H$10,R5+$H$9,$H$10)","v":0.11999999999999998},{"$f":"IF(S5+$H$9>$H$10,S5+$H$9,$H$10)","v":0.10999999999999999},null,"Current Date",null,null,"2011-04-17",null,0.01,-17.240093328277055]
[null,"Terminal GDP Growth Rate",null,null,"%",null,null,{"$f":"AL6/100","v":0.06},null,"Velocity",null,null,null,"x",null,{"$f":"P63/100","v":3.4},{"$f":"Q63/100","v":4},4.12,4.24,4.3,null,"Valuation Assumptions",null,null,null,null,1.4999999999999999E-2,4.705825479479242,null,null,null,null,null,null,null,"DO NOT TOUCH",null,6]
[null,"Increase in GDP Growth Rate",null,null,"%",null,null,{"$f":"AL7/100","v":0.01},null,"GDP",null,null,null,"PKR MM",null,{"$f":"H3*(1+P4)","v":13790400},{"$f":"P7*(1+Q4)","v":14204112},{"$f":"Q7*(1+R4)","v":14772276.48},{"$f":"R7*(1+S4)","v":15510890.304000001},{"$f":"S7*(1+T4)","v":16441543.722240003},null,"Valuation / deal date",null,null,{"$f":"Y5","v":"2011-04-17"},null,0.02,23.162853785605154,null,null,null,null,null,null,null,null,null,1]
[null,"Inflation 2010",null,null,"%",null,null,0.15,null,"Money Supply M2",null,null,null,"PKRMM",null,{"$f":"H4","v":5799709.6587791862},{"$f":"(Q7*(Q4+Q5)/Q6)+P8","v":6403384.418779186},{"$f":"(R7*(R4+R5)/R6)+Q8","v":7012920.0987791857},{"$f":"(S7*(S4+S5)/S6)+R8","v":7634819.0024772985},{"$f":"(T7*(T4+T5)/T6)+S8","v":8284833.5217286479},null,"Exit P/BV multiple",null,null,1.2,null,2.5000000000000001E-2,40.150567360481212]
[null,"Change in Inflation per year",null,null,"%",null,null,{"$f":"-AK9/100","v":-0.01},null,"M2 Growth",null,null,null,"%",null,null,{"$f":"(Q8/P8)-1","v":0.10408706564926051},{"$f":"(R8/Q8)-1","v":9.5189612263854695E-2},{"$f":"(S8/R8)-1","v":8.8679023137077095E-2},{"$f":"(T8/S8)-1","v":8.5138170143972847E-2},null,"Exit P/ E multiple",null,null,11,null,0.03,56.377553074271887,null,null,null,null,null,null,null,null,1,10,70]
[null,"Minimum Inflation",null,null,"%",null,null,{"$f":"AM9/1000","v":7.0000000000000007E-2},null,"Share in industry deposits",null,null,null,"%",null,{"$f":"H23","v":2.4164453539823008E-2},{"$f":"P10+$H$24","v":2.7164453539823007E-2},{"$f":"Q10+$H$24","v":3.0164453539823007E-2},{"$f":"R10+$H$24","v":3.3164453539823009E-2},{"$f":"S10+$H$24","v":3.6164453539823012E-2},null,"Exit P/E = 1 ,Exit P/BV = 2",null,null,1,null,3.5000000000000003E-2,72.158686713180799,null,null,null,null,null,null,null,null,null,null,50]
{"$rows_left_out":105}
{"sheet":"Assumption Sheet","index":1,"n_rows":142,"n_cols":22,"rows_kept":142,"cut":false,"hidden":false,"merged":[]}
[]
[null,null,{"$f":"\"Key Assumptions For \" &'dash board'!Y2","v":"Key Assumptions For Meezan Bank "}]
[null,null,"Company Name",{"$f":"'dash board'!Y2","v":"Meezan Bank "}]
[null,null,"Last Fiscal Year End (dd/mm/yy)",{"$f":"'dash board'!Y3","v":"2010-12-31"}]
[null,null,"Current Share Price",{"$f":"'dash board'!Y4","v":18.64}]
[null,null,"Current Date",{"$f":"'dash board'!Y5","v":"2011-04-17"}]
[null,null,null,null,null,null,null,null,null,null,null,null,1,2,3,4,5]
[null,null,"Macro Economic Assumptions",null,null,null,"Unit",null,null,{"$f":"K8-1","v":2007},{"$f":"L8-1","v":2008},{"$f":"M8-1","v":2009},{"$f":"YEAR(D4)","v":2010},{"$f":"M8+1","v":2011},{"$f":"N8+1","v":2012},{"$f":"O8+1","v":2013},{"$f":"P8+1","v":2014}]
[null,null,"  Nominal GDP",null,null,null,"PKR MM",null,null,null,null,{"$f":"'dash board'!H3","v":13520000},{"$f":"'dash board'!P7","v":13790400},{"$f":"M9*(1+N10)","v":14204112},{"$f":"N9*(1+O10)","v":14772276.48},{"$f":"O9*(1+P10)","v":15510890.304000001},{"$f":"P9*(1+Q10)","v":16441543.722240003}]
[null,null,"GDP Growth rate",null,null,null,"%",null,null,null,null,0.03,{"$f":"'dash board'!P4","v":0.02},{"$f":"IF(M10+1%<6%,M10+1%,6%)","v":0.03},{"$f":"IF(N10+1%<6%,N10+1%,6%)","v":0.04},{"$f":"IF(O10+1%<6%,O10+1%,6%)","v":0.05},{"$f":"IF(P10+1%<6%,P10+1%,6%)","v":0.06}]
{"$rows_left_out":133}
{"sheet":"financial statements","index":2,"n_rows":186,"n_cols":12,"rows_kept":186,"cut":false,"hidden":false,"merged":[]}
[]
[null,null,{"$f":"\"Financial Statement Model for \"&D6","v":"Financial Statement Model for Meezan Bank "}]
[]
[]
[null,null,"General Information"]
[null,null,"Company Name",{"$f":"'dash board'!Y2","v":"Meezan Bank "}]
[null,null,"Last Fiscal Year End (dd/mm/yy)",{"$f":"'dash board'!Y3","v":"2010-12-31"}]
[null,null,"Current Share Price",{"$f":"'dash board'!Y4","v":18.64}]
[null,null,"Current Date",{"$f":"'dash board'!Y5","v":"2011-04-17"}]
[]
{"$rows_left_out":177}
{"sheet":"valuation","index":3,"n_rows":53,"n_cols":7,"rows_kept":53,"cut":false,"hidden":false,"merged":[]}
[]
[null,null,{"$f":"\"Discounted Cash Flow Model for \"&'dash board'!Y2","v":"Discounted Cash Flow Model for Meezan Bank "}]
[null,null,"All figures in thousands, except per share data"]
[]
[null,null,"Operating scenario:"]
[null,null,"Last fiscal year end date:",{"$f":"'dash board'!Y3","v":"2010-12-31"}]
[null,null,"Valuation / deal date",{"$f":"'dash board'!Y5","v":"2011-04-17"}]
[null,null,"Sub year fraction",{"$f":"1-(D7-D6)/365","v":0.70684931506849313}]
[null,null,"Cost of Equity ",{"$f":"IF(ISNUMBER('dash board'!Y12),'dash board'!Y12,valuation!D10)","v":0.2203},{"$f":"IF(ISNUMBER('dash board'!Z12),'dash board'!Z12,valuation!E10)","v":0.21030000000000001},{"$f":"IF(ISNUMBER('dash board'!AA12),'dash board'!AA12,valuation!F10)","v":0.20030000000000003},{"$f":"IF(ISNUMBER('dash board'!AB12),'dash board'!AB12,valuation!G10)","v":0.19030000000000002}]
[null,null,"Discount Rate",{"$f":"D53","v":0.2203},{"$f":"E53","v":0.21030000000000001},0.20030000000000003,0.19030000000000002]
{"$rows_left_out":44}
{"sheet":"comparables","index":4,"n_rows":170,"n_cols":8,"rows_kept":170,"cut":false,"hidden":false,"merged":[]}
[]
[]
[]
[]
[]
[]
[null,null,null,"Askari Bank","Bank Al Habib","Bank Alfalah","Soneri Bank","Meezan Bank"]
[null,null,null,"2010-09-30","2010-09-30","2010-09-30","2010-09-30","2010-09-30"]
[]
[null,null,"Cash & Treasury Balance",20318.898000000001,18041.767,36647.976000000002,6449.8050000000003,9731.3189999999995]
{"$rows_left_out":161}
{"sheet":"Ratio Analysis","index":5,"n_rows":35,"n_cols":13,"rows_kept":35,"cut":false,"hidden":false,"merged":[]}
[]
[null,null,{"$f":"\"Ratio Analysis of \" &'dash board'!Y2","v":"Ratio Analysis of Meezan Bank "}]
[null,null,"Company Name",{"$f":"'dash board'!Y2","v":"Meezan Bank "}]
[null,null,"Last Fiscal Year End (dd/mm/yy)",{"$f":"'dash board'!Y3","v":"2010-12-31"}]
[null,null,"Current Share Price",{"$f":"'dash board'!Y4","v":18.64}]
[null,null,"Current Date",{"$f":"'dash board'!Y5","v":"2011-04-17"}]
[]
[null,"Risk Management Ratios",null,null,"Unit",{"$f":"G8-1","v":2007},{"$f":"H8-1","v":2008},{"$f":"I8-1","v":2009},{"$f":"'dash board'!P2","v":2010},{"$f":"I8+1","v":2011},{"$f":"J8+1","v":2012},{"$f":"K8+1","v":2013},{"$f":"L8+1","v":2014}]
[null,"Total Assets",null,null,"PKR MM",{"$f":"'financial statements'!E99-'financial statements'!E90-'financial statements'!E96","v":61567674},{"$f":"'financial statements'!F99-'financial statements'!F90-'financial statements'!F96","v":78142612},{"$f":"'financial statements'!G99-'financial statements'!G90-'financial statements'!G96","v":114689666},{"$f":"'financial statements'!H99-('Assumption Sheet'!L61*1000)-'financial statements'!H96","v":147795995.09620371},{"$f":"'financial statements'!I99-('Assumption Sheet'!M61*1000)-'financial statements'!I96","v":175687306.28702837},{"$f":"'financial statements'!J99-('Assumption Sheet'!N61*1000)-'financial statements'!J96","v":210009573.83183229},{"$f":"'financial statements'!K99-('Assumption Sheet'!O61*1000)-'financial statements'!K96","v":248179873.34831488},{"$f":"'financial statements'!L99-('Assumption Sheet'!P61*1000)-'financial statements'!L96","v":290059346.29220128}]
[null,"Total Risk Weighted Assets",null,null,"PKR MM",56511241,62337045,71913815,{"$f":"I9*65%","v":96067396.812532425},{"$f":"J9*65%","v":114196749.08656844},{"$f":"K9*65%","v":136506222.99069101},{"$f":"L9*65%","v":161316917.67640468},{"$f":"M9*65%","v":188538575.08993083}]
{"$rows_left_out":26}
{"sheet":"projected financials statements","index":6,"n_rows":114,"n_cols":7,"rows_kept":114,"cut":false,"hidden":false,"merged":[]}
[]
[]
[]
[]
[]
[null,null,"Income Statement",{"$f":"'[2]financial statements'!I13","v":2011},{"$f":"'[2]financial statements'!J13","v":2012},{"$f":"'[2]financial statements'!K13","v":2013},{"$f":"'[2]financial statements'!L13","v":2014}]
[]
[null,null,"On Financing to Customers",{"$f":"'[2]financial statements'!I16","v":5432861.6326085404},{"$f":"'[2]financial statements'!J16","v":5250830.4804170448},{"$f":"'[2]financial statements'!K16","v":5425799.3457663199},{"$f":"'[2]financial statements'!L16","v":6225250.5147764115}]
[null,null,"Interest Earned on Investments",{"$f":"'[2]financial statements'!I17","v":2745842.9003112349},{"$f":"'[2]financial statements'!J17","v":2653841.8554326999},{"$f":"'[2]financial statements'!K17","v":2742273.5235265805},{"$f":"'[2]financial statements'!L17","v":3146327.1264006682}]
[null,null,"On Deposits/Placements with Financial Institutions",{"$f":"'[2]financial statements'!I18","v":3518929.5463158274},{"$f":"'[2]financial statements'!J18","v":3401025.7889383351},{"$f":"'[2]financial statements'!K18","v":3514355.2185463728},{"$f":"'[2]financial statements'!L18","v":4032169.3153717332}]
{"$rows_left_out":105}
{"sheet":"Graphs Data","index":7,"n_rows":5,"n_cols":5,"rows_kept":5,"cut":false,"hidden":false,"merged":[]}
[]
[null,2011,{"$f":"B2+1","v":2012},{"$f":"C2+1","v":2013},2014]
["EPS",{"$f":"'financial statements'!I63","v":3.6659634240713759},{"$f":"'financial statements'!J63","v":4.8075466847823325},{"$f":"'financial statements'!K63","v":6.2681604622947331},{"$f":"'financial statements'!L63","v":6.968948899038276}]
["FCFE / Share",{"$f":"valuation!D20/valuation!$G$29","v":1.6294248447892583},{"$f":"valuation!E20/valuation!$G$29","v":2.8067517611603749},{"$f":"valuation!F20/valuation!$G$29","v":4.1384573571862537},{"$f":"valuation!G20/valuation!$G$29","v":4.8582255269071597}]
["Capital Adequacy Ratio",{"$f":"'Ratio Analysis'!J12","v":0.12602037523492648},{"$f":"'Ratio Analysis'!K12","v":0.13037979177513273},{"$f":"'Ratio Analysis'!L12","v":0.13773159585277603},{"$f":"'Ratio Analysis'!M12","v":0.14388659349271815}]

{"sheet":"strategey","index":8,"n_rows":37,"n_cols":27,"rows_kept":37,"cut":false,"hidden":false,"merged":[]}
[]
[null,null,"Investment Strategy"]
[null,null,"As on Dec,31st 2010 Rupees in 000"]
[null,null,"Equity Investments","Investment","Sector","Weights","Beta","weighted average beta",null,"Future Avaiable ","Beta","weight",null,null,null,null,null,"Future Avaiable ","OGDC","PTC","PPL","POL","NML","FFC","FFBL","LUCK","ENGRO"]
[null,null,"Held for Trading",null,null,null,null,null,null,{"$f":"TRANSPOSE(S4:AA5)","v":"OGDC"},1.0660000000000001,0.05,null,null,null,null,null,"Beta",{"$f":"Sheet1!E203","v":1.0660000000000001},{"$f":"Sheet1!E508","v":1.034},{"$f":"Sheet1!P203","v":0.89600000000000002},{"$f":"Sheet1!P508","v":1.0820000000000001},{"$f":"Sheet1!AA203","v":1.2589999999999999},{"$f":"Sheet1!AA508","v":0.79500000000000004},{"$f":"Sheet1!E813","v":0.79800000000000004},{"$f":"Sheet1!P813","v":1.175},{"$f":"Sheet1!AA812","v":1.1830000000000001}]
[null,null,"PSO",0,"Oil and Gas",{"$f":"D6/$D$30","v":0},1.1200000000000001,{"$f":"G6*F6","v":0},null,"PTC",1.034,0.05,null,null,null,null,null,"weight",0,0,0,0,0,0,0,0,0]
[null,null,"OGDCL",0,"Oil and Gas",{"$f":"D7/$D$30","v":0},1.07,{"$f":"G7*F7","v":0},null,"PPL",0.89600000000000002,0.05,null,null,null,null,null,"weighted average beta"]
[null,null,"FFBL",0,"Fertilizer",0,0.80900000000000005,0,null,"POL",1.0820000000000001,0.05,null,null,null,null,null,"Meezan Beta",1.29]
[null,null,"Avaiablble for sale",null,null,null,null,null,null,"NML",1.2589999999999999,0.05,null,null,null,null,null,"weighted average beta Equity",{"$f":"D37","v":0.1326306257538937}]
[null,null,"Agriauto industries",19521,"Automobile",1.1051121840868601E-2,1.0900000000000001,1.2045722806546776E-2,null,"FFC",0.79500000000000004,0.05,null,null,null,null,null,"Total Beta",{"$f":"SUM(S8:S9)","v":1.4226306257538937}]
{"$rows_left_out":28}
{"sheet":"Sheet1","index":9,"n_rows":1710,"n_cols":33,"rows_kept":1710,"cut":false,"hidden":false,"merged":[]}
["Home ",null,null,null,null,null,null,null,null,null,null,"Home ",null,null,null,null,null,null,null,null,null,null,"Home ",null,null,null,null,null,"Home "]
["News ",null,null,null,null,null,null,null,null,null,null,"News ",null,null,null,null,null,null,null,null,null,null,"News ",null,null,null,null,null,"News "]
[]
[]
["Top Headlines",null,null,null,null,null,null,null,null,null,null,"Top Headlines",null,null,null,null,null,null,null,null,null,null,"Top Headlines",null,null,null,null,null,"Top Headlines"]
["Most Popular",null,null,null,null,null,null,null,null,null,null,"Most Popular",null,null,null,null,null,null,null,null,null,null,"Most Popular",null,null,null,null,null,"Most Popular"]
["Exclusive",null,null,null,null,null,null,null,null,null,null,"Exclusive",null,null,null,null,null,null,null,null,null,null,"Exclusive",null,null,null,null,null,"Exclusive"]
["Worldwide",null,null,null,null,null,null,null,null,null,null,"Worldwide",null,null,null,null,null,null,null,null,null,null,"Worldwide",null,null,null,null,null,"Worldwide"]
["Regions",null,null,null,null,null,null,null,null,null,null,"Regions",null,null,null,null,null,null,null,null,null,null,"Regions",null,null,null,null,null,"Regions"]
["Markets",null,null,null,null,null,null,null,null,null,null,"Markets",null,null,null,null,null,null,null,null,null,null,"Markets",null,null,null,null,null,"Markets"]
{"$rows_left_out":1701}
{"sheet":"Sheet2","index":10,"n_rows":0,"n_cols":0,"rows_kept":0,"cut":false,"hidden":false,"merged":[]}